Reaction Details
TargetCarbonic anhydrase 12
LigandBDBM50027536
Substrate/Competitorn/a
Meas. Tech.ChEMBL_442431 (CHEMBL892596)
Ki 1290000±n/a nM
Citation Temperini, CInnocenti, AGuerri, AScozzafava, ARusconi, SSupuran, CT Phosph(on)ate as a zinc-binding group in metalloenzyme inhibitors: X-ray crystal structure of the antiviral drug foscarnet complexed to human carbonic anhydrase I. Bioorg Med Chem Lett17:2210-5 (2007) 
 
Carbonic anhydrase 12
Name:Carbonic anhydrase 12
Type:Enzyme
Mol. Mass.:39456.00
Organism:Homo sapiens (Human)
Description:Catalytic domain of human cloned isozyme was used in the assay
Residue:354
BDBM50027536
NameBDBM50027536
Synonyms:(phosphonoformate)Trisodium phosphonoformate CHEMBL754 FOSCARNET SODIUM Foscavir trisodium dioxidophosphinecarboxylate oxide trisodium phosphonoformate
TypeSmall organic molecule
Emp. Form.CO5P
Mol. Mass.122.9831
SMILES[O-]C(=O)P([O-])([O-])=O