Reaction Details
TargetNitric oxide synthase, brain
LigandBDBM50206064
Substrate/Competitorn/a
Meas. Tech.ChEMBL_442519 (CHEMBL892684)
IC50 90±n/a nM
Citation Patman, JBhardwaj, NRamnauth, JAnnedi, SCRenton, PMaddaford, SPRakhit, SAndrews, JS Novel 2-aminobenzothiazoles as selective neuronal nitric oxide synthase inhibitors. Bioorg Med Chem Lett17:2540-4 (2007) 
 
Nitric oxide synthase, brain
Name:Nitric oxide synthase, brain
Type:Enzyme
Mol. Mass.:160570.98
Organism:Rattus norvegicus (rat)
Description:Recombinant nNOS overexpressed in E. coli was used in enzyme assays.
Residue:1429
BDBM50206064
NameBDBM50206064
Synonyms:CHEMBL233857 | N-[2-(1-benzyl-piperidin-4-ylamino)-benzothiazol-6-yl]-thiophene-2-carboxamidine
TypeSmall organic molecule
Emp. Form.C24H25N5S2
Mol. Mass.447.619
SMILESNC(=Nc1ccc2nc(NC3CCN(Cc4ccccc4)CC3)sc2c1)c1cccs1