Reaction Details
TargetNitric oxide synthase, brain
LigandBDBM50206073
Substrate/Competitorn/a
Meas. Tech.ChEMBL_442519 (CHEMBL892684)
IC50 50±n/a nM
Citation Patman, JBhardwaj, NRamnauth, JAnnedi, SCRenton, PMaddaford, SPRakhit, SAndrews, JS Novel 2-aminobenzothiazoles as selective neuronal nitric oxide synthase inhibitors. Bioorg Med Chem Lett17:2540-4 (2007) 
 
Nitric oxide synthase, brain
Name:Nitric oxide synthase, brain
Type:Enzyme
Mol. Mass.:160570.98
Organism:Rattus norvegicus (rat)
Description:Recombinant nNOS overexpressed in E. coli was used in enzyme assays.
Residue:1429
BDBM50206073
NameBDBM50206073
Synonyms:CHEMBL233652 | N-[2-(2-pyridin-2-yl-ethylamino)-benzothiazol-6-yl]-thiophene-2-carboxamidine
TypeSmall organic molecule
Emp. Form.C19H17N5S2
Mol. Mass.379.502
SMILESNC(=Nc1ccc2nc(NCCc3ccccn3)sc2c1)c1cccs1