Reaction Details
TargetLow molecular weight phosphotyrosine protein phosphatase
LigandBDBM50371119
Substrate/Competitorn/a
Meas. Tech.ChEMBL_443204 (CHEMBL893452)
Ki>1000000±n/a nM
Citation Vidal, DBlobel, JPérez, YThormann, MPons, M Structure-based discovery of new small molecule inhibitors of low molecular weight protein tyrosine phosphatase. Eur J Med Chem42:1102-8 (2007) 
 
Low molecular weight phosphotyrosine protein phosphatase
Name:Low molecular weight phosphotyrosine protein phosphatase
Type:PROTEIN
Mol. Mass.:18055.33
Organism:Bos taurus
Description:ChEMBL_857178
Residue:158
BDBM50371119
NameBDBM50371119
Synonyms:CHEMBL244696
TypeSmall organic molecule
Emp. Form.C18H16N2O2
Mol. Mass.292.3318
SMILESOC(=O)c1ccc2NC(C3CC=CC3c2c1)c1cccnc1