Reaction Details
TargetLow molecular weight phosphotyrosine protein phosphatase
LigandBDBM50371120
Substrate/Competitorn/a
Meas. Tech.ChEMBL_443204 (CHEMBL893452)
Ki 9000±n/a nM
Citation Vidal, DBlobel, JPérez, YThormann, MPons, M Structure-based discovery of new small molecule inhibitors of low molecular weight protein tyrosine phosphatase. Eur J Med Chem42:1102-8 (2007) 
 
Low molecular weight phosphotyrosine protein phosphatase
Name:Low molecular weight phosphotyrosine protein phosphatase
Type:PROTEIN
Mol. Mass.:18055.33
Organism:Bos taurus
Description:ChEMBL_857178
Residue:158
BDBM50371120
NameBDBM50371120
Synonyms:CHEMBL242173
TypeSmall organic molecule
Emp. Form.C19H16BrNO2
Mol. Mass.370.24
SMILESOC(=O)c1ccc2NC(C3CC=CC3c2c1)c1cccc(Br)c1