Reaction Details
TargetLow molecular weight phosphotyrosine protein phosphatase
LigandBDBM50371122
Substrate/Competitorn/a
Meas. Tech.ChEMBL_443204 (CHEMBL893452)
Ki>1000000±n/a nM
Citation Vidal, DBlobel, JPérez, YThormann, MPons, M Structure-based discovery of new small molecule inhibitors of low molecular weight protein tyrosine phosphatase. Eur J Med Chem42:1102-8 (2007) 
 
Low molecular weight phosphotyrosine protein phosphatase
Name:Low molecular weight phosphotyrosine protein phosphatase
Type:PROTEIN
Mol. Mass.:18055.33
Organism:Bos taurus
Description:ChEMBL_857178
Residue:158
BDBM50371122
NameBDBM50371122
Synonyms:CHEMBL242363
TypeSmall organic molecule
Emp. Form.C17H18N2O5S2
Mol. Mass.394.465
SMILESOC(=O)CCC(=O)N1CCc2cc(ccc12)S(=O)(=O)NCc1cccs1