Reaction Details
TargetLow molecular weight phosphotyrosine protein phosphatase
LigandBDBM50371126
Substrate/Competitorn/a
Meas. Tech.ChEMBL_443204 (CHEMBL893452)
Ki 880000±n/a nM
Citation Vidal, DBlobel, JPérez, YThormann, MPons, M Structure-based discovery of new small molecule inhibitors of low molecular weight protein tyrosine phosphatase. Eur J Med Chem42:1102-8 (2007) 
 
Low molecular weight phosphotyrosine protein phosphatase
Name:Low molecular weight phosphotyrosine protein phosphatase
Type:PROTEIN
Mol. Mass.:18055.33
Organism:Bos taurus
Description:ChEMBL_857178
Residue:158
BDBM50371126
NameBDBM50371126
Synonyms:CHEMBL438508
TypeSmall organic molecule
Emp. Form.C15H13NO3S2
Mol. Mass.319.399
SMILESOC(=O)Cc1ccc(cc1)C1C(=S)NC2C=CSC2C1=O