Reaction Details
TargetTyrosine-protein kinase ABL1
LigandBDBM50178615
Substrate/Competitorn/a
Meas. Tech.ChEMBL_443313 (CHEMBL892514)
IC50 5.1±n/a nM
Citation Horio, THamasaki, TInoue, TWakayama, TItou, SNaito, HAsaki, THayase, HNiwa, T Structural factors contributing to the Abl/Lyn dual inhibitory activity of 3-substituted benzamide derivatives. Bioorg Med Chem Lett17:2712-7 (2007) 
 
Tyrosine-protein kinase ABL1
Name:Tyrosine-protein kinase ABL1
Type:Enzyme
Mol. Mass.:122897.30
Organism:Homo sapiens (Human)
Description:P00519
Residue:1130
BDBM50178615
NameBDBM50178615
Synonyms:CHEMBL203343 | N-(4-methyl-3-(4-(pyridin-3-yl)pyrimidin-2-ylamino)phenyl)-4-((4-methylpiperazin-1-yl)methyl)-3-(trifluoromethyl)benzamide
TypeSmall organic molecule
Emp. Form.C30H30F3N7O
Mol. Mass.561.6007
SMILESCN1CCN(Cc2ccc(cc2C(F)(F)F)C(=O)Nc2ccc(C)c(Nc3nccc(n3)-c3cccnc3)c2)CC1