Reaction Details
TargetCarbonic anhydrase 4
LigandBDBM50208754
Substrate/Competitorn/a
Meas. Tech.ChEMBL_443317 (CHEMBL893565)
Ki 10±n/a nM
Citation Winum, JYThiry, ACheikh, KEDogné, JMMontero, JLVullo, DScozzafava, AMasereel, BSupuran, CT Carbonic anhydrase inhibitors. Inhibition of isoforms I, II, IV, VA, VII, IX, and XIV with sulfonamides incorporating fructopyranose-thioureido tails. Bioorg Med Chem Lett17:2685-91 (2007) 
 
Carbonic anhydrase 4
Name:Carbonic anhydrase 4
Type:Enzyme
Mol. Mass.:35037.98
Organism:Homo sapiens (Human)
Description:P22748
Residue:312
BDBM50208754
NameBDBM50208754
Synonyms:1-(4-sulfamoylphenyl)-3-{[(1R,2S,6S,9R)-4,4,11,11-tetramethyl-3,5,7,10,12-pentaoxatricyclo[7.3.0.0^{2,6}]dodecan-6-yl]methyl}thiourea | CHEMBL232616
TypeSmall organic molecule
Emp. Form.C19H27N3O7S2
Mol. Mass.473.564
SMILESCC1(C)O[C@@H]2CO[C@@]3(CNC(=S)Nc4ccc(cc4)S(N)(=O)=O)OC(C)(C)O[C@H]3[C@@H]2O1