Reaction Details
TargetCarbonic anhydrase 2
LigandBDBM10880
Substrate/Competitorn/a
Meas. Tech.ChEMBL_443316 (CHEMBL893564)
Ki 12±n/a nM
Citation Winum, JYThiry, ACheikh, KEDogné, JMMontero, JLVullo, DScozzafava, AMasereel, BSupuran, CT Carbonic anhydrase inhibitors. Inhibition of isoforms I, II, IV, VA, VII, IX, and XIV with sulfonamides incorporating fructopyranose-thioureido tails. Bioorg Med Chem Lett17:2685-91 (2007) 
 
Carbonic anhydrase 2
Name:Carbonic anhydrase 2
Type:Enzyme
Mol. Mass.:29250.71
Organism:Homo sapiens (Human)
Description:P00918
Residue:260
BDBM10880
NameBDBM10880
Synonyms:AZA AZM acetazolamide Acetazolamide Acetazolamide (AZA) Acetazolamide, 5 Acetazolamide, AZA CHEMBL20 Sulfonamide, 1 US11278534, Example acetazolamide sulfonamide 1
TypeSmall organic molecule
Emp. Form.C4H6N4O3S2
Mol. Mass.222.245
SMILESCC(=O)Nc1nnc(s1)S(N)(=O)=O