Reaction Details
TargetBifunctional epoxide hydrolase 2
LigandBDBM50217444
Substrate/Competitorn/a
Meas. Tech.ChEMBL_444681 (CHEMBL894930)
IC50 0.6±n/a nM
Citation Hwang, SHTsai, HJLiu, JYMorisseau, CHammock, BD Orally bioavailable potent soluble epoxide hydrolase inhibitors. J Med Chem50:3825-40 (2007) 
 
Bifunctional epoxide hydrolase 2
Name:Bifunctional epoxide hydrolase 2
Type:Enzyme
Mol. Mass.:62613.07
Organism:Homo sapiens (Human)
Description:P34913
Residue:555
BDBM50217444
NameBDBM50217444
Synonyms:CHEMBL244002 | cis-4-{4-[3-(4-trifluoromethoxyphenyl)ureido]cyclohexyloxy}-benzoic acid
TypeSmall organic molecule
Emp. Form.C21H21F3N2O5
Mol. Mass.438.397
SMILESOC(=O)c1cccc(O[C@@H]2CC[C@@H](CC2)NC(=O)Nc2ccc(OC(F)(F)F)cc2)c1