Reaction Details
TargetIron-starvation protein PigA
LigandBDBM50371141
Substrate/Competitorn/a
Meas. Tech.ChEMBL_444781 (CHEMBL895029)
Kd 44700±n/a nM
Citation Furci, LMLopes, PEakanunkul, SZhong, SMacKerell, ADWilks, A Inhibition of the bacterial heme oxygenases from Pseudomonas aeruginosa and Neisseria meningitidis: novel antimicrobial targets. J Med Chem50:3804-13 (2007) 
 
Iron-starvation protein PigA
Name:Iron-starvation protein PigA
Type:PROTEIN
Mol. Mass.:21946.19
Organism:Pseudomonas aeruginosa
Description:ChEMBL_444781
Residue:198
BDBM50371141
NameBDBM50371141
Synonyms:CHEMBL230431
TypeSmall organic molecule
Emp. Form.C12H10N4O2
Mol. Mass.242.2334
SMILESO=C(NNC(=O)c1ccncc1)c1ccncc1