Reaction Details
TargetCannabinoid receptor 2
LigandBDBM50218116
Substrate/Competitorn/a
Meas. Tech.ChEMBL_444842 (CHEMBL895097)
EC50 28±n/a nM
Citation Dziadulewicz, EKBevan, SJBrain, CTCoote, PRCulshaw, AJDavis, AJEdwards, LJFisher, AJFox, AJGentry, CGroarke, AHart, TWHuber, WJames, IFKesingland, ALa Vecchia, LLoong, YLyothier, IMcNair, KO'Farrell, CPeacock, MPortmann, RSchopfer, UYaqoob, MZadrobilek, J Naphthalen-1-yl-(4-pentyloxynaphthalen-1-yl)methanone: a potent, orally bioavailable human CB1/CB2 dual agonist with antihyperalgesic properties and restricted central nervous system penetration. J Med Chem50:3851-6 (2007) 
 
Cannabinoid receptor 2
Name:Cannabinoid receptor 2
Type:G Protein-Coupled Receptor (GPCR)
Mol. Mass.:39690.94
Organism:Homo sapiens (Human)
Description:P34972
Residue:360
BDBM50218116
NameBDBM50218116
Synonyms:CHEMBL244403 | naphthalen-1-yl-(4-pentyloxynaphthalen-1-yl)methanone
TypeSmall organic molecule
Emp. Form.C26H24O2
Mol. Mass.368.4676
SMILESCCCCCOc1ccc(C(=O)c2cccc3ccccc23)c2ccccc12