Reaction Details
TargetCannabinoid receptor 1
LigandBDBM50218122
Substrate/Competitorn/a
Meas. Tech.ChEMBL_444838 (CHEMBL895093)
IC50 930±n/a nM
Citation Dziadulewicz, EKBevan, SJBrain, CTCoote, PRCulshaw, AJDavis, AJEdwards, LJFisher, AJFox, AJGentry, CGroarke, AHart, TWHuber, WJames, IFKesingland, ALa Vecchia, LLoong, YLyothier, IMcNair, KO'Farrell, CPeacock, MPortmann, RSchopfer, UYaqoob, MZadrobilek, J Naphthalen-1-yl-(4-pentyloxynaphthalen-1-yl)methanone: a potent, orally bioavailable human CB1/CB2 dual agonist with antihyperalgesic properties and restricted central nervous system penetration. J Med Chem50:3851-6 (2007) 
 
Cannabinoid receptor 1
Name:Cannabinoid receptor 1
Type:G Protein-Coupled Receptor (GPCR)
Mol. Mass.:52868.96
Organism:Homo sapiens (Human)
Description:P21554
Residue:472
BDBM50218122
NameBDBM50218122
Synonyms:CHEMBL244607 | naphthalen-1-yl-(4-phenethyloxynaphthalen-1-yl)methanone
TypeSmall organic molecule
Emp. Form.C29H22O2
Mol. Mass.402.4838
SMILESO=C(c1cccc2ccccc12)c1ccc(OCCc2ccccc2)c2ccccc12