Reaction Details
TargetCannabinoid receptor 1
LigandBDBM50218118
Substrate/Competitorn/a
Meas. Tech.ChEMBL_444838 (CHEMBL895093)
IC50 1100±n/a nM
Citation Dziadulewicz, EKBevan, SJBrain, CTCoote, PRCulshaw, AJDavis, AJEdwards, LJFisher, AJFox, AJGentry, CGroarke, AHart, TWHuber, WJames, IFKesingland, ALa Vecchia, LLoong, YLyothier, IMcNair, KO'Farrell, CPeacock, MPortmann, RSchopfer, UYaqoob, MZadrobilek, J Naphthalen-1-yl-(4-pentyloxynaphthalen-1-yl)methanone: a potent, orally bioavailable human CB1/CB2 dual agonist with antihyperalgesic properties and restricted central nervous system penetration. J Med Chem50:3851-6 (2007) 
 
Cannabinoid receptor 1
Name:Cannabinoid receptor 1
Type:G Protein-Coupled Receptor (GPCR)
Mol. Mass.:52868.96
Organism:Homo sapiens (Human)
Description:P21554
Residue:472
BDBM50218118
NameBDBM50218118
Synonyms:CHEMBL244189 | [4-(2-morpholin-4-ylethoxy)naphthalen-1-yl]naphthalene-1-ylmethanone
TypeSmall organic molecule
Emp. Form.C27H25NO3
Mol. Mass.411.4923
SMILESO=C(c1cccc2ccccc12)c1ccc(OCCN2CCOCC2)c2ccccc12