Reaction Details
TargetNeuronal acetylcholine receptor subunit alpha-7
LigandBDBM50366779
Substrate/Competitorn/a
Meas. Tech.ChEMBL_445991 (CHEMBL896284)
Ki 6.10±n/a nM
Citation Jensen, AAZlotos, DPLiljefors, T Pharmacological characteristics and binding modes of caracurine V analogues and related compounds at the neuronal alpha7 nicotinic acetylcholine receptor. J Med Chem50:4616-29 (2007) 
 
Neuronal acetylcholine receptor subunit alpha-7
Name:Neuronal acetylcholine receptor subunit alpha-7
Type:n/a
Mol. Mass.:56448.33
Organism:Homo sapiens (Human)
Description: CHRNA7 (NACHRA7)
Residue:502
BDBM50366779
NameBDBM50366779
Synonyms:METHYLLYCACONITINE
TypeSmall organic molecule
Emp. Form.C37H50N2O10
Mol. Mass.682.8003
SMILESCCN1C[C@]2(COC(=O)c3ccccc3-n3c(O)cc(C)c3O)CC[C@H](OC)[C@@]34[C@@H]5C[C@H]6[C@H](OC)[C@@H]5[C@](O)(C[C@@H]6OC)[C@](O)([C@@H](OC)[C@H]23)[C@H]14