Reaction Details
TargetBeta-2 adrenergic receptor
LigandBDBM50221767
Substrate/Competitorn/a
Meas. Tech.ChEMBL_446237 (CHEMBL895342)
EC50 20000±n/a nM
Citation Buonsanti, MFBertinaria, MStilo, ADCena, CFruttero, RGasco, A Nitric oxide donor beta2-agonists: furoxan derivatives containing the fenoterol moiety and related furazans. J Med Chem50:5003-11 (2007) 
 
Beta-2 adrenergic receptor
Name:Beta-2 adrenergic receptor
Type:PROTEIN
Mol. Mass.:46896.26
Organism:Rattus norvegicus
Description:ChEMBL_38603
Residue:418
BDBM50221767
NameBDBM50221767
Synonyms:5-(1-hydroxy-2-{1-methyl-2-[4-(4-methyl-5-oxy-furazan-3-ylmethoxy)-phenyl]-ethylamino}-ethyl)-benzene-1,3-diol | CHEMBL395082
TypeSmall organic molecule
Emp. Form.C21H25N3O6
Mol. Mass.415.4397
SMILESCC(Cc1ccc(OCc2no[n+]([O-])c2C)cc1)NCC(O)c1cc(O)cc(O)c1