Reaction Details
TargetCholinesterase
LigandBDBM50221920
Substrate/Competitorn/a
Meas. Tech.ChEMBL_446305 (CHEMBL895408)
IC50 505±n/a nM
Citation Bolognesi, MLBanzi, RBartolini, MCavalli, ATarozzi, AAndrisano, VMinarini, ARosini, MTumiatti, VBergamini, CFato, RLenaz, GHrelia, PCattaneo, ARecanatini, MMelchiorre, C Novel class of quinone-bearing polyamines as multi-target-directed ligands to combat Alzheimer's disease. J Med Chem50:4882-97 (2007) 
 
Cholinesterase
Name:Cholinesterase
Type:Homotetramer
Mol. Mass.:68422.27
Organism:Homo sapiens (Human)
Description:P06276
Residue:602
BDBM50221920
NameBDBM50221920
Synonyms:CHEMBL230434 | N,N'-bis{6-[ethyl(2-methoxybenzyl)amino]hexyl}benzene-1,4-diamine
TypeSmall organic molecule
Emp. Form.C38H58N4O2
Mol. Mass.602.8927
SMILESCCN(CCCCCCNc1ccc(NCCCCCCN(CC)Cc2ccccc2OC)cc1)Cc1ccccc1OC