Reaction Details
TargetCholinesterase
LigandBDBM50221922
Substrate/Competitorn/a
Meas. Tech.ChEMBL_446305 (CHEMBL895408)
IC50 462±n/a nM
Citation Bolognesi, MLBanzi, RBartolini, MCavalli, ATarozzi, AAndrisano, VMinarini, ARosini, MTumiatti, VBergamini, CFato, RLenaz, GHrelia, PCattaneo, ARecanatini, MMelchiorre, C Novel class of quinone-bearing polyamines as multi-target-directed ligands to combat Alzheimer's disease. J Med Chem50:4882-97 (2007) 
 
Cholinesterase
Name:Cholinesterase
Type:Homotetramer
Mol. Mass.:68422.27
Organism:Homo sapiens (Human)
Description:P06276
Residue:602
BDBM50221922
NameBDBM50221922
Synonyms:2,5-bis{6-[ethyl(2-methoxybenzyl)amino]hexylamino}-3,6-dimethyl-[1,4]-benzoquinone | CHEMBL243269
TypeSmall organic molecule
Emp. Form.C40H60N4O4
Mol. Mass.660.9288
SMILESCCN(CCCCCCNc1c(C)c(O)c(N=CCCCCCN(CC)Cc2ccccc2OC)c(C)c1O)Cc1ccccc1OC