Reaction Details
TargetAcetylcholinesterase
LigandBDBM50221929
Substrate/Competitorn/a
Meas. Tech.ChEMBL_446304 (CHEMBL895407)
IC50 7.8±n/a nM
Citation Bolognesi, MLBanzi, RBartolini, MCavalli, ATarozzi, AAndrisano, VMinarini, ARosini, MTumiatti, VBergamini, CFato, RLenaz, GHrelia, PCattaneo, ARecanatini, MMelchiorre, C Novel class of quinone-bearing polyamines as multi-target-directed ligands to combat Alzheimer's disease. J Med Chem50:4882-97 (2007) 
 
Acetylcholinesterase
Name:Acetylcholinesterase
Type:Enzyme
Mol. Mass.:67792.70
Organism:Homo sapiens (Human)
Description:P22303
Residue:614
BDBM50221929
NameBDBM50221929
Synonyms:2,5-bis{7-[ethyl(2-methoxybenzyl)amino]heptylamino}-[1,4]-benzoquinone | CHEMBL243273
TypeSmall organic molecule
Emp. Form.C40H60N4O4
Mol. Mass.660.9288
SMILESCCN(CCCCCCCNc1cc(O)c(cc1O)N=CCCCCCCN(CC)Cc1ccccc1OC)Cc1ccccc1OC