Reaction Details
TargetAcetylcholinesterase
LigandBDBM50221917
Substrate/Competitorn/a
Meas. Tech.ChEMBL_446304 (CHEMBL895407)
IC50 593±n/a nM
Citation Bolognesi, MLBanzi, RBartolini, MCavalli, ATarozzi, AAndrisano, VMinarini, ARosini, MTumiatti, VBergamini, CFato, RLenaz, GHrelia, PCattaneo, ARecanatini, MMelchiorre, C Novel class of quinone-bearing polyamines as multi-target-directed ligands to combat Alzheimer's disease. J Med Chem50:4882-97 (2007) 
 
Acetylcholinesterase
Name:Acetylcholinesterase
Type:Enzyme
Mol. Mass.:67792.70
Organism:Homo sapiens (Human)
Description:P22303
Residue:614
BDBM50221917
NameBDBM50221917
Synonyms:2,5-bis{6-[(2-chlorobenzyl)ethylamino]hexylamino}-[1,4]-benzoquinone | CHEMBL243057
TypeSmall organic molecule
Emp. Form.C36H50Cl2N4O2
Mol. Mass.641.714
SMILESCCN(CCCCCCNc1cc(O)c(cc1O)N=CCCCCCN(CC)Cc1ccccc1Cl)Cc1ccccc1Cl