Reaction Details
TargetAcetylcholinesterase
LigandBDBM50221921
Substrate/Competitorn/a
Meas. Tech.ChEMBL_446304 (CHEMBL895407)
IC50 14±n/a nM
Citation Bolognesi, MLBanzi, RBartolini, MCavalli, ATarozzi, AAndrisano, VMinarini, ARosini, MTumiatti, VBergamini, CFato, RLenaz, GHrelia, PCattaneo, ARecanatini, MMelchiorre, C Novel class of quinone-bearing polyamines as multi-target-directed ligands to combat Alzheimer's disease. J Med Chem50:4882-97 (2007) 
 
Acetylcholinesterase
Name:Acetylcholinesterase
Type:Enzyme
Mol. Mass.:67792.70
Organism:Homo sapiens (Human)
Description:P22303
Residue:614
BDBM50221921
NameBDBM50221921
Synonyms:2,5-bis{4-[ethyl(2-methoxybenzyl)amino]butylamino}-[1,4]-benzoquinone | CHEMBL243272
TypeSmall organic molecule
Emp. Form.C34H48N4O4
Mol. Mass.576.7693
SMILESCCN(CCCCNc1cc(O)c(cc1O)N=CCCCN(CC)Cc1ccccc1OC)Cc1ccccc1OC