Reaction Details
Target5-hydroxytryptamine receptor 2C
LigandBDBM50222859
Substrate/Competitorn/a
Meas. Tech.ChEMBL_446533 (CHEMBL896830)
Ki 120±n/a nM
Citation Rudolph, JEsler, WPO'connor, SCoish, PDWickens, PLBrands, MBierer, DEBloomquist, BTBondar, GChen, LChuang, CYClaus, THFathi, ZFu, WKhire, URKristie, JALiu, XGLowe, DBMcClure, ACMichels, MOrtiz, AARamsden, PDSchoenleber, RWShelekhin, TEVakalopoulos, ATang, WWang, LYi, LGardell, SJLivingston, JNSweet, LJBullock, WH Quinazolinone derivatives as orally available ghrelin receptor antagonists for the treatment of diabetes and obesity. J Med Chem50:5202-16 (2007) 
 
5-hydroxytryptamine receptor 2C
Name:5-hydroxytryptamine receptor 2C
Type:G Protein-Coupled Receptor (GPCR)
Mol. Mass.:51836.79
Organism:Homo sapiens (Human)
Description:P28335
Residue:458
BDBM50222859
NameBDBM50222859
Synonyms:6-(4-chlorophenyl)-3-{[(3S)-1-ethylpiperidin-3-yl]methyl}-2-(2-methylphenyl)quinazolin-4(3H)-one | CHEMBL243884
TypeSmall organic molecule
Emp. Form.C29H30ClN3O
Mol. Mass.472.021
SMILESCCN1CCC[C@H](Cn2c(nc3ccc(cc3c2=O)-c2ccc(Cl)cc2)-c2ccccc2C)C1