Reaction Details
TargetGrowth hormone secretagogue receptor type 1
LigandBDBM50222872
Substrate/Competitorn/a
Meas. Tech.ChEMBL_446527 (CHEMBL895698)
Ki 5700±n/a nM
Citation Rudolph, JEsler, WPO'connor, SCoish, PDWickens, PLBrands, MBierer, DEBloomquist, BTBondar, GChen, LChuang, CYClaus, THFathi, ZFu, WKhire, URKristie, JALiu, XGLowe, DBMcClure, ACMichels, MOrtiz, AARamsden, PDSchoenleber, RWShelekhin, TEVakalopoulos, ATang, WWang, LYi, LGardell, SJLivingston, JNSweet, LJBullock, WH Quinazolinone derivatives as orally available ghrelin receptor antagonists for the treatment of diabetes and obesity. J Med Chem50:5202-16 (2007) 
 
Growth hormone secretagogue receptor type 1
Name:Growth hormone secretagogue receptor type 1
Synonyms:Ghrelin receptor
Type:PROTEIN
Mol. Mass.:41494.35
Organism:Ovis aries
Description:ChEMBL_446527
Residue:366
BDBM50222872
NameBDBM50222872
TypeSmall organic molecule
Emp. Form.C25H30FN3O
Mol. Mass.407.5236
SMILESCCN1CCC[C@@H](Cn2c(nc3ccc(cc3c2=O)-c2ccc(F)cc2)C(C)C)C1