Reaction Details
TargetMu-type opioid receptor
LigandBDBM50027251
Substrate/Competitorn/a
Meas. Tech.ChEMBL_446660 (CHEMBL896955)
EC50 149±n/a nM
Citation Rennison, DNeal, APCami-Kobeci, GAceto, MDMartinez-Bermejo, FLewis, JWHusbands, SM Cinnamoyl derivatives of 7alpha-aminomethyl-6,14-endo-ethanotetrahydrothebaine and 7alpha-aminomethyl-6,14-endo-ethanotetrahydrooripavine and related opioid ligands. J Med Chem50:5176-82 (2007) 
 
Mu-type opioid receptor
Name:Mu-type opioid receptor
Type:G Protein-Coupled Receptor (GPCR)
Mol. Mass.:44789.51
Organism:Homo sapiens (Human)
Description:P35372
Residue:400
BDBM50027251
NameBDBM50027251
Synonyms:CHEMBL2113310
TypeSmall organic molecule
Emp. Form.C31H37ClN2O3
Mol. Mass.521.09
SMILES[H][C@@]12Oc3c4c(C[C@@]5([H])N(C)CC[C@@]14[C@@]51CC[C@]2(OC)[C@@H](CNC\C=C\c2ccc(Cl)cc2)C1)ccc3OC