Reaction Details
TargetMu-type opioid receptor
LigandBDBM50027230
Substrate/Competitorn/a
Meas. Tech.ChEMBL_446657 (CHEMBL896952)
Ki 0.150000±n/a nM
Citation Rennison, DNeal, APCami-Kobeci, GAceto, MDMartinez-Bermejo, FLewis, JWHusbands, SM Cinnamoyl derivatives of 7alpha-aminomethyl-6,14-endo-ethanotetrahydrothebaine and 7alpha-aminomethyl-6,14-endo-ethanotetrahydrooripavine and related opioid ligands. J Med Chem50:5176-82 (2007) 
 
Mu-type opioid receptor
Name:Mu-type opioid receptor
Type:G Protein-Coupled Receptor (GPCR)
Mol. Mass.:44789.51
Organism:Homo sapiens (Human)
Description:P35372
Residue:400
BDBM50027230
NameBDBM50027230
Synonyms:CHEMBL2113666
TypeSmall organic molecule
Emp. Form.C26H25ClN2O3
Mol. Mass.448.941
SMILES[H][C@@]12Oc3cccc4C[C@@]5([H])N(C)CC[C@@]1(c34)[C@]5(CCC2=O)NC(=O)\C=C\c1ccccc1Cl