Reaction Details
TargetMu-type opioid receptor
LigandBDBM50027239
Substrate/Competitorn/a
Meas. Tech.ChEMBL_446657 (CHEMBL896952)
Ki 3±n/a nM
Citation Rennison, DNeal, APCami-Kobeci, GAceto, MDMartinez-Bermejo, FLewis, JWHusbands, SM Cinnamoyl derivatives of 7alpha-aminomethyl-6,14-endo-ethanotetrahydrothebaine and 7alpha-aminomethyl-6,14-endo-ethanotetrahydrooripavine and related opioid ligands. J Med Chem50:5176-82 (2007) 
 
Mu-type opioid receptor
Name:Mu-type opioid receptor
Type:G Protein-Coupled Receptor (GPCR)
Mol. Mass.:44789.51
Organism:Homo sapiens (Human)
Description:P35372
Residue:400
BDBM50027239
NameBDBM50027239
Synonyms:CHEMBL2113300 | SJ000091719
TypeSmall organic molecule
Emp. Form.C31H35N3O6
Mol. Mass.545.6261
SMILES[H][C@@]12Oc3c4c(C[C@@]5([H])N(C)CC[C@@]14[C@@]51CC[C@]2(OC)[C@@H](CNC(=O)\C=C\c2ccccc2[N+]([O-])=O)C1)ccc3OC