Reaction Details
TargetKappa-type opioid receptor
LigandBDBM50027240
Substrate/Competitorn/a
Meas. Tech.ChEMBL_446661 (CHEMBL896956)
EC50 159±n/a nM
Citation Rennison, DNeal, APCami-Kobeci, GAceto, MDMartinez-Bermejo, FLewis, JWHusbands, SM Cinnamoyl derivatives of 7alpha-aminomethyl-6,14-endo-ethanotetrahydrothebaine and 7alpha-aminomethyl-6,14-endo-ethanotetrahydrooripavine and related opioid ligands. J Med Chem50:5176-82 (2007) 
 
Kappa-type opioid receptor
Name:Kappa-type opioid receptor
Type:G Protein-Coupled Receptor (GPCR)
Mol. Mass.:42648.76
Organism:Homo sapiens (Human)
Description:P41145
Residue:380
BDBM50027240
NameBDBM50027240
Synonyms:CHEMBL2113301
TypeSmall organic molecule
Emp. Form.C32H38N2O5
Mol. Mass.530.6545
SMILES[H][C@@]12Oc3c4c(C[C@@]5([H])N(C)CC[C@@]14[C@@]51CC[C@]2(OC)[C@@H](CNC(=O)\C=C\c2ccccc2OC)C1)ccc3OC