Reaction Details
TargetMu-type opioid receptor
LigandBDBM50027246
Substrate/Competitorn/a
Meas. Tech.ChEMBL_446657 (CHEMBL896952)
Ki 0.220000±n/a nM
Citation Rennison, DNeal, APCami-Kobeci, GAceto, MDMartinez-Bermejo, FLewis, JWHusbands, SM Cinnamoyl derivatives of 7alpha-aminomethyl-6,14-endo-ethanotetrahydrothebaine and 7alpha-aminomethyl-6,14-endo-ethanotetrahydrooripavine and related opioid ligands. J Med Chem50:5176-82 (2007) 
 
Mu-type opioid receptor
Name:Mu-type opioid receptor
Type:G Protein-Coupled Receptor (GPCR)
Mol. Mass.:44789.51
Organism:Homo sapiens (Human)
Description:P35372
Residue:400
BDBM50027246
NameBDBM50027246
Synonyms:CHEMBL2113313
TypeSmall organic molecule
Emp. Form.C32H34N2O4
Mol. Mass.510.6234
SMILES[H][C@]12CN(C[C@@]1([H])[C@]13C=C[C@@]2(OC)[C@]2([H])Oc4c5c(C[C@@]1([H])N(C)CC[C@@]325)ccc4O)C(=O)\C=C\c1ccccc1C