Reaction Details
TargetCoagulation factor X
LigandBDBM50216576
Substrate/Competitorn/a
Meas. Tech.ChEMBL_447824 (CHEMBL898074)
Ki 1.3±n/a nM
Citation Qiao, JXChang, CHCheney, DLMorin, PEWang, GZKing, SRWang, TCRendina, ARLuettgen, JMKnabb, RMWexler, RRLam, PY SAR and X-ray structures of enantiopure 1,2-cis-(1R,2S)-cyclopentyldiamine and cyclohexyldiamine derivatives as inhibitors of coagulation Factor Xa. Bioorg Med Chem Lett17:4419-27 (2007) 
 
Coagulation factor X
Name:Coagulation factor X
Type:Enzyme
Mol. Mass.:54726.60
Organism:Homo sapiens (Human)
Description:n/a
Residue:488
BDBM50216576
NameBDBM50216576
Synonyms:CHEMBL231940 | cis-N-(2-(4-(2-oxopyridin-1(2H)-yl)benzylamino)cyclohexyl)-3-chloro-1H-indole-6-carboxamide
TypeSmall organic molecule
Emp. Form.C27H27ClN4O2
Mol. Mass.474.982
SMILESClc1c[nH]c2cc(ccc12)C(=O)N[C@@H]1CCCC[C@@H]1NCc1ccc(cc1)-n1ccccc1=O