Reaction Details
TargetCoagulation factor X
LigandBDBM50216588
Substrate/Competitorn/a
Meas. Tech.ChEMBL_447824 (CHEMBL898074)
Ki 20±n/a nM
Citation Qiao, JXChang, CHCheney, DLMorin, PEWang, GZKing, SRWang, TCRendina, ARLuettgen, JMKnabb, RMWexler, RRLam, PY SAR and X-ray structures of enantiopure 1,2-cis-(1R,2S)-cyclopentyldiamine and cyclohexyldiamine derivatives as inhibitors of coagulation Factor Xa. Bioorg Med Chem Lett17:4419-27 (2007) 
 
Coagulation factor X
Name:Coagulation factor X
Type:Enzyme
Mol. Mass.:54726.60
Organism:Homo sapiens (Human)
Description:n/a
Residue:488
BDBM50216588
NameBDBM50216588
Synonyms:6-chloro-N-((1R,2S)-2-(4-(2-oxopyridin-1(2H)-yl)benzamido)cyclohexyl)-2-naphthamide | CHEMBL233332
TypeSmall organic molecule
Emp. Form.C29H26ClN3O3
Mol. Mass.499.988
SMILESClc1ccc2cc(ccc2c1)C(=O)N[C@@H]1CCCC[C@@H]1NC(=O)c1ccc(cc1)-n1ccccc1=O