Reaction Details
TargetCoagulation factor X
LigandBDBM50216589
Substrate/Competitorn/a
Meas. Tech.ChEMBL_447824 (CHEMBL898074)
Ki 10±n/a nM
Citation Qiao, JXChang, CHCheney, DLMorin, PEWang, GZKing, SRWang, TCRendina, ARLuettgen, JMKnabb, RMWexler, RRLam, PY SAR and X-ray structures of enantiopure 1,2-cis-(1R,2S)-cyclopentyldiamine and cyclohexyldiamine derivatives as inhibitors of coagulation Factor Xa. Bioorg Med Chem Lett17:4419-27 (2007) 
 
Coagulation factor X
Name:Coagulation factor X
Type:Enzyme
Mol. Mass.:54726.60
Organism:Homo sapiens (Human)
Description:n/a
Residue:488
BDBM50216589
NameBDBM50216589
Synonyms:3-chloro-N-(1-(4-(2-oxopyridin-1(2H)-yl)benzamido)propan-2-yl)-1H-indole-6-carboxamide | CHEMBL231750
TypeSmall organic molecule
Emp. Form.C24H21ClN4O3
Mol. Mass.448.902
SMILESCC(CNC(=O)c1ccc(cc1)-n1ccccc1=O)NC(=O)c1ccc2c(Cl)c[nH]c2c1