Reaction Details
TargetCoagulation factor X
LigandBDBM50216615
Substrate/Competitorn/a
Meas. Tech.ChEMBL_447824 (CHEMBL898074)
Ki 892±n/a nM
Citation Qiao, JXChang, CHCheney, DLMorin, PEWang, GZKing, SRWang, TCRendina, ARLuettgen, JMKnabb, RMWexler, RRLam, PY SAR and X-ray structures of enantiopure 1,2-cis-(1R,2S)-cyclopentyldiamine and cyclohexyldiamine derivatives as inhibitors of coagulation Factor Xa. Bioorg Med Chem Lett17:4419-27 (2007) 
 
Coagulation factor X
Name:Coagulation factor X
Type:Enzyme
Mol. Mass.:54726.60
Organism:Homo sapiens (Human)
Description:n/a
Residue:488
BDBM50216615
NameBDBM50216615
Synonyms:4-chloro-3-methoxy-N-{(1R,2S)-2-[4-(2-oxo-2H-pyridin-1-yl)-benzoylamino]-cyclopentyl}-benzamide | CHEMBL393813
TypeSmall organic molecule
Emp. Form.C25H24ClN3O4
Mol. Mass.465.929
SMILESCOc1cc(ccc1Cl)C(=O)N[C@@H]1CCC[C@@H]1NC(=O)c1ccc(cc1)-n1ccccc1=O