Reaction Details
TargetCoagulation factor XI
LigandBDBM50216556
Substrate/Competitorn/a
Meas. Tech.ChEMBL_447829 (CHEMBL898079)
Ki>15000±n/a nM
Citation Qiao, JXChang, CHCheney, DLMorin, PEWang, GZKing, SRWang, TCRendina, ARLuettgen, JMKnabb, RMWexler, RRLam, PY SAR and X-ray structures of enantiopure 1,2-cis-(1R,2S)-cyclopentyldiamine and cyclohexyldiamine derivatives as inhibitors of coagulation Factor Xa. Bioorg Med Chem Lett17:4419-27 (2007) 
 
Coagulation factor XI
Name:Coagulation factor XI
Type:Enzyme
Mol. Mass.:70130.58
Organism:Homo sapiens (Human)
Description:P03951
Residue:625
BDBM50216556
NameBDBM50216556
Synonyms:3-CHLORO-N-((1R,2S) -2-(4-(2-OXOPYRIDIN-1(2H)-YL)BENZAMIDO)CYCLOHEXYL)-1H-INDOLE-6-CARBOXAMIDE CHEMBL398380
TypeSmall organic molecule
Emp. Form.C27H25ClN4O3
Mol. Mass.488.965
SMILESClc1c[nH]c2cc(ccc12)C(=O)N[C@@H]1CCCC[C@@H]1NC(=O)c1ccc(cc1)-n1ccccc1=O