Reaction Details
TargetCarbonic anhydrase 2
LigandBDBM10885
Substrate/Competitorn/a
Meas. Tech.ChEMBL_448894 (CHEMBL898040)
Ki 3±n/a nM
Citation Salmon, AJWilliams, MLInnocenti, AVullo, DSupuran, CTPoulsen, SA Inhibition of carbonic anhydrase isozymes I, II and IX with benzenesulfonamides containing an organometallic moiety. Bioorg Med Chem Lett17:5032-5 (2007) 
 
Carbonic anhydrase 2
Name:Carbonic anhydrase 2
Type:Enzyme
Mol. Mass.:29250.71
Organism:Homo sapiens (Human)
Description:P00918
Residue:260
BDBM10885
NameBDBM10885
Synonyms:(4R)-4-(ethylamino)-2-(3-methoxypropyl)-1,1-dioxo-2H,3H,4H-1,7,2-thieno[3,2-e][1,2]thiazine-6-sulfonamide AL-4862 Brinzolamide (BRZ) | brinzolamide
TypeSmall organic molecule
Emp. Form.C12H21N3O5S3
Mol. Mass.383.507
SMILESCCN[C@H]1CN(CCCOC)S(=O)(=O)c2sc(cc12)S(N)(=O)=O