Reaction Details
TargetGlucocorticoid receptor
LigandBDBM50219449
Substrate/Competitorn/a
Meas. Tech.ChEMBL_448942 (CHEMBL899205)
IC50 19±n/a nM
Citation Kuzmich, DKirrane, TProudfoot, JBekkali, YZindell, RBeck, LNelson, RShih, CKKukulka, AJPaw, ZReilly, PDeleon, RCardozo, MNabozny, GThomson, D Identification of dissociated non-steroidal glucocorticoid receptor agonists. Bioorg Med Chem Lett17:5025-31 (2007) 
 
Glucocorticoid receptor
Name:Glucocorticoid receptor
Type:Enzyme
Mol. Mass.:85656.87
Organism:Homo sapiens (Human)
Description:P04150
Residue:777
BDBM50219449
NameBDBM50219449
Synonyms:3-chloro-4-(4-(5-fluoro-2-methoxyphenyl)-2-hydroxy-4-methyl-2-(trifluoromethyl)pentyl)benzaldehyde | CHEMBL392289
TypeSmall organic molecule
Emp. Form.C21H21ClF4O3
Mol. Mass.432.836
SMILESCOc1ccc(F)cc1C(C)(C)CC(O)(Cc1ccc(C=O)cc1Cl)C(F)(F)F