Reaction Details
TargetMineralocorticoid receptor
LigandBDBM50219452
Substrate/Competitorn/a
Meas. Tech.ChEMBL_448944 (CHEMBL899207)
IC50 220±n/a nM
Citation Kuzmich, DKirrane, TProudfoot, JBekkali, YZindell, RBeck, LNelson, RShih, CKKukulka, AJPaw, ZReilly, PDeleon, RCardozo, MNabozny, GThomson, D Identification of dissociated non-steroidal glucocorticoid receptor agonists. Bioorg Med Chem Lett17:5025-31 (2007) 
 
Mineralocorticoid receptor
Name:Mineralocorticoid receptor
Type:Enzyme
Mol. Mass.:107076.42
Organism:Homo sapiens (Human)
Description:P08235
Residue:984
BDBM50219452
NameBDBM50219452
Synonyms:2-(3,5-dimethylbenzyl)-1,1,1-trifluoro-4-(5-fluoro-2-methoxyphenyl)-4-methylpentan-2-ol | CHEMBL393392
TypeSmall organic molecule
Emp. Form.C22H26F4O2
Mol. Mass.398.4343
SMILESCOc1ccc(F)cc1C(C)(C)CC(O)(Cc1cc(C)cc(C)c1)C(F)(F)F