Reaction Details
TargetGlucocorticoid receptor
LigandBDBM50219470
Substrate/Competitorn/a
Meas. Tech.ChEMBL_448942 (CHEMBL899205)
IC50 370±n/a nM
Citation Kuzmich, DKirrane, TProudfoot, JBekkali, YZindell, RBeck, LNelson, RShih, CKKukulka, AJPaw, ZReilly, PDeleon, RCardozo, MNabozny, GThomson, D Identification of dissociated non-steroidal glucocorticoid receptor agonists. Bioorg Med Chem Lett17:5025-31 (2007) 
 
Glucocorticoid receptor
Name:Glucocorticoid receptor
Type:Enzyme
Mol. Mass.:85656.87
Organism:Homo sapiens (Human)
Description:P04150
Residue:777
BDBM50219470
NameBDBM50219470
Synonyms:2-(2-fluorobenzyl)-1,1,1-trifluoro-4-(5-fluoro-2-methoxyphenyl)-4-methylpentan-2-ol | CHEMBL237385
TypeSmall organic molecule
Emp. Form.C20H21F5O2
Mol. Mass.388.3716
SMILESCOc1ccc(F)cc1C(C)(C)CC(O)(Cc1ccccc1F)C(F)(F)F