Reaction Details
TargetDipeptidyl peptidase 4
LigandBDBM50221075
Substrate/Competitorn/a
Meas. Tech.ChEMBL_449465 (CHEMBL899730)
IC50 19±n/a nM
Citation Wright, SWAmmirati, MJAndrews, KMBrodeur, AMDanley, DEDoran, SDLillquist, JSLiu, SMcClure, LDMcPherson, RKOlson, TVOrena, SJParker, JCRocke, BNSoeller, WCSoglia, CBTreadway, JLVanvolkenburg, MAZhao, ZCox, ED (3R,4S)-4-(2,4,5-Trifluorophenyl)-pyrrolidin-3-ylamine inhibitors of dipeptidyl peptidase IV: synthesis, in vitro, in vivo, and X-ray crystallographic characterization. Bioorg Med Chem Lett17:5638-42 (2007) 
 
Dipeptidyl peptidase 4
Name:Dipeptidyl peptidase 4
Type:Enzyme
Mol. Mass.:88271.01
Organism:Homo sapiens (Human)
Description:P27487
Residue:766
BDBM50221075
NameBDBM50221075
Synonyms:1-(3-(6-((3R,4S)-3-amino-4-(2,4,5-trifluorophenyl)pyrrolidin-1-yl)pyrimidin-4-yl)phenyl)ethanone | CHEMBL393612
TypeSmall organic molecule
Emp. Form.C22H19F3N4O
Mol. Mass.412.4077
SMILESCC(=O)c1cccc(c1)-c1cc(ncn1)N1C[C@H](N)[C@H](C1)c1cc(F)c(F)cc1F