Reaction Details
TargetCarbonic anhydrase 3
LigandBDBM50221406
Substrate/Competitorn/a
Meas. Tech.ChEMBL_449604 (CHEMBL898699)
Ki 2300±n/a nM
Citation Nishimori, IMinakuchi, TOnishi, SVullo, DCecchi, AScozzafava, ASupuran, CT Carbonic anhydrase inhibitors: cloning, characterization, and inhibition studies of the cytosolic isozyme III with sulfonamides. Bioorg Med Chem15:7229-36 (2007) 
 
Carbonic anhydrase 3
Name:Carbonic anhydrase 3
Type:Enzyme
Mol. Mass.:29562.11
Organism:Homo sapiens (Human)
Description:Human cloned isozyme.
Residue:260
BDBM50221406
NameBDBM50221406
Synonyms:6-acetamido-4-hydroxy-3-((4-sulfamoylphenyl)diazenyl)naphthalene-2,7-disulfonic acid CHEMBL237251
TypeSmall organic molecule
Emp. Form.C18H16N4O10S3
Mol. Mass.544.535
SMILESCC(=O)Nc1cc2c(O)c(N=Nc3ccc(cc3)S(N)(=O)=O)c(cc2cc1S(O)(=O)=O)S(O)(=O)=O