Reaction Details
TargetCarbonic anhydrase 3
LigandBDBM11639
Substrate/Competitorn/a
Meas. Tech.ChEMBL_449604 (CHEMBL898699)
Ki 154000±n/a nM
Citation Nishimori, IMinakuchi, TOnishi, SVullo, DCecchi, AScozzafava, ASupuran, CT Carbonic anhydrase inhibitors: cloning, characterization, and inhibition studies of the cytosolic isozyme III with sulfonamides. Bioorg Med Chem15:7229-36 (2007) 
 
Carbonic anhydrase 3
Name:Carbonic anhydrase 3
Type:Enzyme
Mol. Mass.:29562.11
Organism:Homo sapiens (Human)
Description:Human cloned isozyme.
Residue:260
BDBM11639
NameBDBM11639
Synonyms:4-[5-(4-methylphenyl)-3-(trifluoromethyl)-1H-pyrazol-1-yl]benzene-1-sulfonamide CLX Celecoxib US11478464, Compound Celecoxib US8741944, Comparative Compound cid_2662
TypeSmall organic molecule
Emp. Form.C17H14F3N3O2S
Mol. Mass.381.372
SMILESCc1ccc(cc1)-c1cc(nn1-c1ccc(cc1)S(N)(=O)=O)C(F)(F)F