Reaction Details
TargetCarbonic anhydrase 3
LigandBDBM10855
Substrate/Competitorn/a
Meas. Tech.ChEMBL_449604 (CHEMBL898699)
Ki 887000±n/a nM
Citation Nishimori, IMinakuchi, TOnishi, SVullo, DCecchi, AScozzafava, ASupuran, CT Carbonic anhydrase inhibitors: cloning, characterization, and inhibition studies of the cytosolic isozyme III with sulfonamides. Bioorg Med Chem15:7229-36 (2007) 
 
Carbonic anhydrase 3
Name:Carbonic anhydrase 3
Type:Enzyme
Mol. Mass.:29562.11
Organism:Homo sapiens (Human)
Description:Human cloned isozyme.
Residue:260
BDBM10855
NameBDBM10855
Synonyms:2-aminobenzene-1-sulfonamide US10172837, 2-aminobenzenesulfonamide orthanilamide 17
TypeSmall organic molecule
Emp. Form.C6H8N2O2S
Mol. Mass.172.205
SMILESNc1ccccc1S(N)(=O)=O