Reaction Details
TargetSerine/threonine-protein kinase Chk1
LigandBDBM50222916
Substrate/Competitorn/a
Meas. Tech.ChEMBL_449978 (CHEMBL899086)
Ki 0.190000±n/a nM
Citation Teng, MZhu, JJohnson, MDChen, PKornmann, JChen, EBlasina, ARegister, JAnderes, KRogers, CDeng, YNinkovic, SGrant, SHu, QLundgren, KPeng, ZKania, RS Structure-based design and synthesis of (5-arylamino-2H-pyrazol-3-yl)-biphenyl-2',4'-diols as novel and potent human CHK1 inhibitors. J Med Chem50:5253-6 (2007) 
 
Serine/threonine-protein kinase Chk1
Name:Serine/threonine-protein kinase Chk1
Type:Enzyme Catalytic Domain
Mol. Mass.:54443.02
Organism:Homo sapiens (Human)
Description:gi_166295192
Residue:476
BDBM50222916
NameBDBM50222916
Synonyms:4'-{5-[4-(dimethylamino-methyl)-phenylamino]-2H-pyrazol-3-yl}-biphenyl-2,4-diol | CHEMBL392692
TypeSmall organic molecule
Emp. Form.C24H24N4O2
Mol. Mass.400.473
SMILESCN(C)Cc1ccc(Nc2cc(n[nH]2)-c2ccc(cc2)-c2ccc(O)cc2O)cc1