Reaction Details
TargetSerine/threonine-protein kinase Chk1
LigandBDBM50222920
Substrate/Competitorn/a
Meas. Tech.ChEMBL_449979 (CHEMBL899087)
EC50 230±n/a nM
Citation Teng, MZhu, JJohnson, MDChen, PKornmann, JChen, EBlasina, ARegister, JAnderes, KRogers, CDeng, YNinkovic, SGrant, SHu, QLundgren, KPeng, ZKania, RS Structure-based design and synthesis of (5-arylamino-2H-pyrazol-3-yl)-biphenyl-2',4'-diols as novel and potent human CHK1 inhibitors. J Med Chem50:5253-6 (2007) 
 
Serine/threonine-protein kinase Chk1
Name:Serine/threonine-protein kinase Chk1
Type:Enzyme Catalytic Domain
Mol. Mass.:54443.02
Organism:Homo sapiens (Human)
Description:gi_166295192
Residue:476
BDBM50222920
NameBDBM50222920
Synonyms:4'-{5-[6-(sec-butylamino-methyl)-pyridin-3-ylamino]-1H-pyrazol-3-yl}-biphenyl-2,4-diol | CHEMBL392900
TypeSmall organic molecule
Emp. Form.C25H27N5O2
Mol. Mass.429.5142
SMILESCCC(C)NCc1ccc(Nc2cc(n[nH]2)-c2ccc(cc2)-c2ccc(O)cc2O)cn1