Reaction Details
TargetSerine/threonine-protein kinase Chk1
LigandBDBM50222915
Substrate/Competitorn/a
Meas. Tech.ChEMBL_449979 (CHEMBL899087)
EC50 41±n/a nM
Citation Teng, MZhu, JJohnson, MDChen, PKornmann, JChen, EBlasina, ARegister, JAnderes, KRogers, CDeng, YNinkovic, SGrant, SHu, QLundgren, KPeng, ZKania, RS Structure-based design and synthesis of (5-arylamino-2H-pyrazol-3-yl)-biphenyl-2',4'-diols as novel and potent human CHK1 inhibitors. J Med Chem50:5253-6 (2007) 
 
Serine/threonine-protein kinase Chk1
Name:Serine/threonine-protein kinase Chk1
Type:Enzyme Catalytic Domain
Mol. Mass.:54443.02
Organism:Homo sapiens (Human)
Description:gi_166295192
Residue:476
BDBM50222915
NameBDBM50222915
Synonyms:4'-[5-(4-pyrrolidin-1-ylmethyl-phenylamino)-1H-pyrazol-3-yl]-biphenyl-2,4-diol | CHEMBL241231
TypeSmall organic molecule
Emp. Form.C26H26N4O2
Mol. Mass.426.5102
SMILESOc1ccc(c(O)c1)-c1ccc(cc1)-c1cc(Nc2ccc(CN3CCCC3)cc2)[nH]n1