Reaction Details
TargetSerine/threonine-protein kinase Chk1
LigandBDBM50222922
Substrate/Competitorn/a
Meas. Tech.ChEMBL_449978 (CHEMBL899086)
Ki 301±n/a nM
Citation Teng, MZhu, JJohnson, MDChen, PKornmann, JChen, EBlasina, ARegister, JAnderes, KRogers, CDeng, YNinkovic, SGrant, SHu, QLundgren, KPeng, ZKania, RS Structure-based design and synthesis of (5-arylamino-2H-pyrazol-3-yl)-biphenyl-2',4'-diols as novel and potent human CHK1 inhibitors. J Med Chem50:5253-6 (2007) 
 
Serine/threonine-protein kinase Chk1
Name:Serine/threonine-protein kinase Chk1
Type:Enzyme Catalytic Domain
Mol. Mass.:54443.02
Organism:Homo sapiens (Human)
Description:gi_166295192
Residue:476
BDBM50222922
NameBDBM50222922
Synonyms:3-(1H-benzo[d]imidazol-2-yl)-N-(4-hydroxyphenyl)-1H-indazole-6-carboxamide | CHEMBL392765
TypeSmall organic molecule
Emp. Form.C21H15N5O2
Mol. Mass.369.3761
SMILESOc1ccc(NC(=O)c2ccc3c(n[nH]c3c2)-c2nc3ccccc3[nH]2)cc1