Reaction Details
TargetMuscarinic acetylcholine receptor M2
LigandBDBM50371194
Substrate/Competitorn/a
Meas. Tech.ChEMBL_450046 (CHEMBL899143)
Ki 10.38±n/a nM
Citation Dallanoce, CDe Amici, MBarocelli, EBertoni, SRoth, BLErnsberger, PDe Micheli, C Novel oxotremorine-related heterocyclic derivatives: Synthesis and in vitro pharmacology at the muscarinic receptor subtypes. Bioorg Med Chem15:7626-37 (2007) 
 
Muscarinic acetylcholine receptor M2
Name:Muscarinic acetylcholine receptor M2
Type:GPCR
Mol. Mass.:51730.61
Organism:Homo sapiens (Human)
Description:P08172
Residue:466
BDBM50371194
NameBDBM50371194
Synonyms:CHEMBL1256938
TypeSmall organic molecule
Emp. Form.C34H58N4O2
Mol. Mass.554.8499
SMILESCOc1ccccc1NCCCCCCNCCCCCCCCNCCCCCCNc1ccccc1OC