Reaction Details
TargetEnoyl-[acyl-carrier-protein] reductase [NADH] FabI
LigandBDBM50223365
Substrate/Competitorn/a
Meas. Tech.ChEMBL_450121 (CHEMBL900393)
IC50>32000±n/a nM
Citation Ozawa, TKitagawa, HYamamoto, YTakahata, SIida, MOsaki, YYamada, K Phenylimidazole derivatives as specific inhibitors of bacterial enoyl-acyl carrier protein reductase FabK. Bioorg Med Chem15:7325-36 (2007) 
 
Enoyl-[acyl-carrier-protein] reductase [NADH] FabI
Name:Enoyl-[acyl-carrier-protein] reductase [NADH] FabI
Type:Enzyme
Mol. Mass.:27861.12
Organism:Escherichia coli
Description:n/a
Residue:262
BDBM50223365
NameBDBM50223365
Synonyms:1-((1H-benzo[d]imidazol-2-yl)methyl)-3-(6-methylbenzo[d]thiazol-2-yl)urea | CHEMBL237835
TypeSmall organic molecule
Emp. Form.C17H15N5OS
Mol. Mass.337.399
SMILESCc1ccc2nc(NC(=O)NCc3nc4ccccc4[nH]3)sc2c1