Reaction Details
TargetBeta-2 adrenergic receptor
LigandBDBM50223441
Substrate/Competitorn/a
Meas. Tech.ChEMBL_450127 (CHEMBL900403)
EC50 0.031000±n/a nM
Citation Brown, ADBunnage, MEGlossop, PAHolbrook, MJones, RDLane, CALewthwaite, RAMantell, SPerros-Huguet, CPrice, DAWebster, R The discovery of indole-derived long acting beta2-adrenoceptor agonists for the treatment of asthma and COPD. Bioorg Med Chem Lett17:6188-91 (2007) 
 
Beta-2 adrenergic receptor
Name:Beta-2 adrenergic receptor
Type:n/a
Mol. Mass.:46461.69
Organism:Homo sapiens (Human)
Description:P07550
Residue:413
BDBM50223441
NameBDBM50223441
Synonyms:5-{(R)-2-[(R)-2-hydroxy-2-(4-hydroxy-3-hydroxymethyl-phenyl)-ethylamino]-propyl}-1H-indole-2-carboxylic acid (4H-1lambda*4*-thiazol-2-ylmethyl)-amide | CHEMBL430361
TypeSmall organic molecule
Emp. Form.C25H28N4O4S
Mol. Mass.480.579
SMILESC[C@H](Cc1ccc2[nH]c(cc2c1)C(=O)NCc1nccs1)NC[C@H](O)c1ccc(O)c(CO)c1