Reaction Details
TargetBeta-2 adrenergic receptor
LigandBDBM50223438
Substrate/Competitorn/a
Meas. Tech.ChEMBL_450127 (CHEMBL900403)
EC50 0.687000±n/a nM
Citation Brown, ADBunnage, MEGlossop, PAHolbrook, MJones, RDLane, CALewthwaite, RAMantell, SPerros-Huguet, CPrice, DAWebster, R The discovery of indole-derived long acting beta2-adrenoceptor agonists for the treatment of asthma and COPD. Bioorg Med Chem Lett17:6188-91 (2007) 
 
Beta-2 adrenergic receptor
Name:Beta-2 adrenergic receptor
Type:n/a
Mol. Mass.:46461.69
Organism:Homo sapiens (Human)
Description:P07550
Residue:413
BDBM50223438
NameBDBM50223438
Synonyms:CHEMBL238347 | N-(2,6-dimethoxybenzyl)-1-benzyl-5-((R)-2-((R)-2-hydroxy-2-(4-hydroxy-3-(hydroxymethyl)phenyl)ethylamino)propyl)-1H-indole-2-carboxamide
TypeSmall organic molecule
Emp. Form.C37H41N3O6
Mol. Mass.623.7379
SMILESCOc1cccc(OC)c1CNC(=O)c1cc2cc(C[C@@H](C)NC[C@H](O)c3ccc(O)c(CO)c3)ccc2n1Cc1ccccc1